Disilicon dihydride

Gas phase ion energetics data

Data compiled as indicated in comments:
LL - Sharon G. Lias and Joel F. Liebman
LBLHLM - Sharon G. Lias, John E. Bartmess, Joel F. Liebman, John L. Holmes, Rhoda D. Levin, and W. Gary Mallard

Ionization energy determinations

IE (eV) Method Reference Comment
8.20 ± 0.02PIRuscic and Berkowitz, 1991LL
≤7.68 ± 0.16DERBoo and Armentrout, 1987LBLHLM

References

Ruscic and Berkowitz, 1991
Ruscic, B.; Berkowitz, J., Photoionization mass spectrometric studies of the transient species Si2Hn (n = 2-5), J. Chem. Phys., 1991, 95, 2416. [all data]

Boo and Armentrout, 1987
Boo, B.H.; Armentrout, P.B., Reaction of silicon ion (2P) with silane (SiH4, SiD4) heats of formation of SiHn, SiHn+ (n=1,2,3), and Si2Hn+ (n=0,1,2,3) remarkable isotope exchange reaction involving four hydrogen shifts, J. Am. Chem. Soc., 1987, 109, 3549. [all data]