Cobalt, nonacarbonyl[μ3-(methoxyoxoethylidyne)]tri-, triangulo

Gas phase ion energetics data

Data compiled by: Sharon G. Lias, John E. Bartmess, Joel F. Liebman, John L. Holmes, Rhoda D. Levin, and W. Gary Mallard

Ionization energy determinations

IE (eV) Method Reference Comment
8.1PEGranozzi, Tondello, et al., 1982
8.73PEGranozzi, Tondello, et al., 1982Vertical value

References

Granozzi, Tondello, et al., 1982
Granozzi, G.; Tondello, E.; Ajo, D.; Casarin, M.; Aime, S.; Osella, D., Gas phase helium I photoelectron spectra of methinyltricobalt enneacarbonyl clusters, Inorg. Chem., 1982, 21, 1081. [all data]