Strontium hydroxide cation

Gas phase thermochemistry data

Quantity Value Units Method Reference Comment
gas,1 bar241.06J/mol*KReviewChase, 1998Data last reviewed in June, 1976

Reaction thermochemistry data

Data compiled by: Michael M. Meot-Ner (Mautner) and Sharon G. Lias

Individual Reactions

HOSr+ + Water = (HOSr+ • Water)

By formula: HOSr+ + H2O = (HOSr+ • H2O)

Quantity Value Units Method Reference Comment
Δr125.kJ/molMSBurdett and Hayhurst, 1982gas phase; flame source, about 1600 K
Quantity Value Units Method Reference Comment
Δr90.0J/mol*KMSBurdett and Hayhurst, 1982gas phase; flame source, about 1600 K

References

Chase, 1998
Chase, M.W., Jr., NIST-JANAF Themochemical Tables, Fourth Edition, J. Phys. Chem. Ref. Data, Monograph 9, 1998, 1-1951. [all data]

Burdett and Hayhurst, 1982
Burdett, N.A.; Hayhurst, A.N., Hydration of gas phase ions and the measurement of boundary layer cooling during flame sampling into a mass spectrometer., J. Chem. Soc. Faraday Trans. 1, 1982, 78, 2997. [all data]