Butyl trifluoroacetate

Phase change data

Data compiled as indicated in comments:
BS - Robert L. Brown and Stephen E. Stein
AC - William E. Acree, Jr., James S. Chickos

Quantity Value Units Method Reference Comment
Tboil373.3KN/APCR Inc., 1990BS

Enthalpy of vaporization

ΔvapH (kcal/mol) Temperature (K) Method Reference Comment
9.03358.A,EBStephenson and Malanowski, 1987Based on data from 343. - 377. K. See also Sheehan and Langer, 1969.; AC

References

PCR Inc., 1990
PCR Inc., Research Chemicals Catalog 1990-1991, PCR Inc., Gainesville, FL, 1990, 1. [all data]

Stephenson and Malanowski, 1987
Stephenson, Richard M.; Malanowski, Stanislaw, Handbook of the Thermodynamics of Organic Compounds, 1987, https://doi.org/10.1007/978-94-009-3173-2 . [all data]

Sheehan and Langer, 1969
Sheehan, Richard J.; Langer, Stanley H., Vapor pressures of fluorine- and silicon-containing derivatives of some hydroxylic compounds, J. Chem. Eng. Data, 1969, 14, 2, 248-250, https://doi.org/10.1021/je60041a011 . [all data]