N-nitroso-O,N-bis(trifluoromethyl)hydroxylamine

Phase change data

Data compiled by: William E. Acree, Jr., James S. Chickos

Enthalpy of vaporization

ΔvapH (kJ/mol) Temperature (K) Method Reference Comment
25.4277.AStephenson and Malanowski, 1987Based on data from 272. - 283. K. See also Jander and Haszeldine, 1954.

References

Stephenson and Malanowski, 1987
Stephenson, Richard M.; Malanowski, Stanislaw, Handbook of the Thermodynamics of Organic Compounds, 1987, https://doi.org/10.1007/978-94-009-3173-2 . [all data]

Jander and Haszeldine, 1954
Jander, J.; Haszeldine, R.N., Addition of free radicals to unsaturated systems. Part VI. Free-radical addition to the nitroso-group, J. Chem. Soc., 1954, 696, https://doi.org/10.1039/jr9540000696 . [all data]