Iron, tricarbonyl[(1,2,3,4,5-η5)-heptahydro-1,2-dicarbapentaborate(2-)]-

Gas phase ion energetics data

Data compiled by: Sharon G. Lias, Rhoda D. Levin, and Sherif A. Kafafi

Ionization energy determinations

IE (eV) Method Reference
8.7PEUlman, Andersen, et al., 1978

References

Ulman, Andersen, et al., 1978
Ulman, J.A.; Andersen, E.L.; Fehlner, T.P., Characterization of ferraboranes by ultraviolet photoelectron spectroscopy, J. Am. Chem. Soc., 1978, 100, 456. [all data]