N-(2,2-Dinitro-2-fluoroethyl)-4,4,4-trinitrobutyramide

Condensed phase thermochemistry data

Data compiled by: Hussein Y. Afeefy, Joel F. Liebman, and Stephen E. Stein

Quantity Value Units Method Reference Comment
Δfsolid-148.8kcal/molCcbKorepin, Galkin, et al., 1994
Quantity Value Units Method Reference Comment
Δcsolid-684.13 ± 0.55kcal/molCcbKorepin, Galkin, et al., 1994

References

Korepin, Galkin, et al., 1994
Korepin, A.G.; Galkin, P.V.; Golovina, N.I.; Trofimova, R.F.; Avdonin, V.V.; Kirpichev, E.P.; Rubtsov, Yu.I.; Lagodzinskaya, G.V.; Loginova, M.V., Preparation and properties of secondary amides of 1,1-dinitroalkanecarboxylic acids, Russ. Chem. Bull. (Engl. Transl.), 1994, 43, 821-825. [all data]