1,4-Benzodioxin-2-carboxylic acid, 2,3-dihydro-

Phase change data

Data compiled by: William E. Acree, Jr., James S. Chickos

Quantity Value Units Method Reference Comment
Δsub117.8 ± 2.1kJ/molCMatos, Miranda, et al., 2008

References

Matos, Miranda, et al., 2008
Matos, M. Agostinha R.; Miranda, Margarida S.; Morais, Victor M.F., 3,4,5-Trimethoxyphenol: A combined experimental and theoretical thermochemical investigation of its antioxidant capacity, The Journal of Chemical Thermodynamics, 2008, 40, 4, 625-631, https://doi.org/10.1016/j.jct.2007.11.006 . [all data]