4-ethyl-2-nitroaniline

Phase change data

Data compiled by: Thermodynamics Research Center, NIST Boulder Laboratories, Chris Muzny director

Quantity Value Units Method Reference Comment
Tfus317.15KN/AAltau, Beasley, et al., 1963Uncertainty assigned by TRC = 1. K

In addition to the Thermodynamics Research Center (TRC) data available from this site, much more physical and chemical property data is available from the following TRC products:

References

Altau, Beasley, et al., 1963
Altau, K.; Beasley, J.G.; Pine, H.J.; Crawford, R.H.; Tucker, W.T.; Brown, A.D.; Capps, J.D., Some Derivatives of Ethylbenzene, J. Chem. Eng. Data, 1963, 8, 122. [all data]