Cycloheptadecanone

Condensed phase thermochemistry data

Data compiled by: Hussein Y. Afeefy, Joel F. Liebman, and Stephen E. Stein

Quantity Value Units Method Reference Comment
Δcsolid-10727. ± 11.kJ/molCcbRuzieka and Schlapfer, 1933Reanalyzed by Cox and Pilcher, 1970, Original value = -10720. kJ/mol; Corresponding Δfsolid = -536.01 kJ/mol (simple calculation by NIST; no Washburn corrections)

Phase change data

Data compiled as indicated in comments:
BS - Robert L. Brown and Stephen E. Stein
ALS - Hussein Y. Afeefy, Joel F. Liebman, and Stephen E. Stein

Reduced pressure boiling point

Tboil (K) Pressure (bar) Reference Comment
418.20.0004Weast and Grasselli, 1989BS

Enthalpy of sublimation

ΔsubH (kJ/mol) Temperature (K) Method Reference Comment
75.7 ± 0.8333.VWolf and Weghofer, 1938ALS

References

Ruzieka and Schlapfer, 1933
Ruzieka, L.; Schlapfer, P., Zur kenntnis des kohlenstoffringes XXII. Uber die verbrennungswarme bei hochgliedrigen ringverbindungen, Helv. Chim. Acta, 1933, 16, 162-169. [all data]

Cox and Pilcher, 1970
Cox, J.D.; Pilcher, G., Thermochemistry of Organic and Organometallic Compounds, Academic Press, New York, 1970, 1-636. [all data]

Weast and Grasselli, 1989
CRC Handbook of Data on Organic Compounds, 2nd Editon, Weast,R.C and Grasselli, J.G., ed(s)., CRC Press, Inc., Boca Raton, FL, 1989, 1. [all data]

Wolf and Weghofer, 1938
Wolf, K.L.; Weghofer, H., Uber sublimationswarmen, Z. Phys. Chem., 1938, 39, 194-208. [all data]