Cobalt,bis[(1,2,3,4,5,6-η6)-1-methoxyboratabenzene]-

Gas phase ion energetics data

Data compiled by: Sharon G. Lias, Rhoda D. Levin, and Sherif A. Kafafi

Ionization energy determinations

IE (eV) Method Reference
7.0 ± 0.1EIHerberich, Greiss, et al., 1971

References

Herberich, Greiss, et al., 1971
Herberich, G.E.; Greiss, G.; Heil, H.F.; Muller, J., Paramagnetic borabenzene cobalt complexes, Chem. Commun., 1971, 1328. [all data]