Mercury, chloro((E)-2-phenylethenyl)-

Gas phase ion energetics data

Data compiled as indicated in comments:
LBLHLM - Sharon G. Lias, John E. Bartmess, Joel F. Liebman, John L. Holmes, Rhoda D. Levin, and W. Gary Mallard
LLK - Sharon G. Lias, Rhoda D. Levin, and Sherif A. Kafafi

Ionization energy determinations

IE (eV) Method Reference Comment
8.3PEBaidin, Chizhov, et al., 1981LLK
9.44 ± 0.05PEBaidin, Timoshenko, et al., 1985Vertical value; LBLHLM
8.77PEBaidin, Chizhov, et al., 1981Vertical value; LLK

References

Baidin, Chizhov, et al., 1981
Baidin, V.N.; Chizhov, Y.V.; Timoshenko, M.M.; Ustynyuk, Y.A.; Kritskaya, I.I., He(I) photoelectronic spectra of organic compounds with a mercury atom attached to an sp2 hybridized carbon, Bull. Acad. Sci. USSR, Div. Chem. Sci., 1981, 2362. [all data]

Baidin, Timoshenko, et al., 1985
Baidin, V.N.; Timoshenko, M.M.; Chizhov, Y.V.; Ustynyuk, Y.A.; Kritskaya, I.I., Photoelectron spectra nad the structure of organomercury compounds, J. Organomet. Chem., 1985, 292, 55. [all data]