Thieno[3,4-c]thiophene-2,5-5(iv),1,3,4,6-tetraphenyl-

Gas phase ion energetics data

Data compiled by: Sharon G. Lias, Rhoda D. Levin, and Sherif A. Kafafi

Ionization energy determinations

IE (eV) Method Reference Comment
6.19PEMuller, Schweig, et al., 1976Vertical value

References

Muller, Schweig, et al., 1976
Muller, C.; Schweig, A.; Cava, M.P.; Lakshmikantham, M.V., Thieno[3,4-c]thiophenes. Electronic structure, J. Am. Chem. Soc., 1976, 98, 7187. [all data]