BF3Cl-

Vibrational and/or electronic energy levels

Data compiled by: Marilyn E. Jacox

State:   X

Vib.
sym.
 No.   Approximate
 type of mode
 cm-1   Med.   Method   References

BF stretch 1210 Cs Ar IR Hunt and Ault, 1981
BCl stretch 840 Cs Ar IR Hunt and Ault, 1981

Additional references: Jacox, 1994, page 302

References

Hunt and Ault, 1981
Hunt, R.L.; Ault, B.S., Spectrochim. Acta, 1981, 37A, 63. [all data]

Jacox, 1994
Jacox, M.E., Vibrational and electronic energy levels of polyatomic transient molecules, American Chemical Society, Washington, DC, 1994, 464. [all data]