Dolabradiene

Kovats' RI, non-polar column, isothermal

View large format table.

Column type Active phase Temperature (C) I Reference Comment
CapillarySE-30170.1945.Perry and Weavers, 1984
CapillarySE-30190.1970.Perry and Weavers, 1984

Kovats' RI, polar column, isothermal

View large format table.

Column type Active phase Temperature (C) I Reference Comment
CapillaryCarbowax 20M170.2283.Perry and Weavers, 1984
CapillaryCarbowax 20M190.2318.Perry and Weavers, 1984

Normal alkane RI, non-polar column, temperature ramp

View large format table.

Column type Active phase I Reference Comment
CapillaryDB-51970.Kobaisy, Tellez, et al., 200230. m/0.25 mm/0.25 μm, He, 3. K/min; Tstart: 60. C; Tend: 240. C

References

Perry and Weavers, 1984
Perry, N.B.; Weavers, R.T., Kovats indices of diterpene hydrocarbons on fused-silica capillary columns, J. Chromatogr., 1984, 284, 478-481, https://doi.org/10.1016/S0021-9673(01)87850-X . [all data]

Kobaisy, Tellez, et al., 2002
Kobaisy, M.; Tellez, M.R.; Dayan, F.E.; Duke, S.O., Phytotoxicity and volatile constituents from leaves of Callicarpa japonica Thunb., Phytochemistry, 2002, 61, 1, 37-40, https://doi.org/10.1016/S0031-9422(02)00207-8 . [all data]