Polypentadecanolactone

Phase change data

Data compiled by: Eugene S. Domalski and Elizabeth D. Hearing

Enthalpy of fusion

ΔfusH (kJ/mol) Temperature (K) Reference Comment
56.000370.4Yevstropov, Lebedev, et al., 1983100% crystallinity.

Entropy of fusion

ΔfusS (J/mol*K) Temperature (K) Reference Comment
151.370.4Yevstropov, Lebedev, et al., 1983100%

Enthalpy of phase transition

ΔHtrs (kJ/mol) Temperature (K) Initial Phase Final Phase Reference Comment
0.251.glass Yevstropov, Lebedev, et al., 1983

Entropy of phase transition

ΔStrs (J/mol*K) Temperature (K) Initial Phase Final Phase Reference Comment
0.251.glass, Glass to high, elastic stateYevstropov, Lebedev, et al., 1983

References

Yevstropov, Lebedev, et al., 1983
Yevstropov, A.A.; Lebedev, B.V.; Krparisova, Ye.G., Thermodynamics of pentadecanolactone, of the process of its polymerization and of the resultant polypentadecanolactone in the 0 to 400 K region, Vysokomol. Soedin, Ser., 1983, A 25(8), 1679-1685. [all data]