1,2-Benzenedicarboxylic acid, diheptyl ester

Van Den Dool and Kratz RI, non-polar column, temperature ramp

Data compiled by: NIST Mass Spectrometry Data Center, William E. Wallace, director

Column type CapillaryCapillary
Active phase DB-1DB-1
Column length (m) 30.30.
Carrier gas
Substrate
Column diameter (mm) 0.20.2
Phase thickness (μm) 0.250.25
Tstart (C) 50.50.
Tend (C) 300.300.
Heat rate (K/min) 5.5.
Initial hold (min) 2.2.
Final hold (min) 5.5.
I 2485.2485.
ReferenceJohnson, Urso, et al., 1997Johnson, Urso, et al., 1997
Comment MSDC-RI MSDC-RI

Kovats' RI, non-polar column, isothermal

View large format table.

Column type Active phase Temperature (C) I Reference Comment
CapillaryOV-101230.2494.Friocourt, Berthou, et al., 197950. m/0.3 mm/0.35 μm, N2
CapillaryOV-101230.2495.Friocourt, Berthou, et al., 197950. m/0.3 mm/0.35 μm, H2
CapillarySE-30250.2497.Friocourt, Berthou, et al., 197942. m/0.3 mm/0.39 μm, He
PackedSE-30220.2472.Zulaïca and Guiochon, 1963Column length: 2. m

Kovats' RI, non-polar column, custom temperature program

View large format table.

Column type Active phase I Reference Comment
PackedSE-302500.Ramsey, Lee, et al., 1980He, Chromosorb G HP (80-100 mesh); Column length: 1.5 m; Program: not specified

Van Den Dool and Kratz RI, non-polar column, custom temperature program

View large format table.

Column type Active phase I Reference Comment
Capillary5 % Phenyl methyl siloxane2453.Yasuhara, Shiraishi, et al., 199725. m/0.31 mm/0.52 μm, He; Program: 50C(2min) => (20C/min) => 120C => (7C/min) => 310C(10min)

Normal alkane RI, non-polar column, custom temperature program

View large format table.

Column type Active phase I Reference Comment
CapillarySqualane2497.Chen, 2008Program: not specified
CapillaryOV-1, SE-30, Methyl silicone, SP-2100, OV-101, DB-1, etc.2494.Waggott and Davies, 1984Hydrogen; Column length: 50. m; Column diameter: 0.32 mm; Program: not specified
CapillaryOV-1, SE-30, Methyl silicone, SP-2100, OV-101, DB-1, etc.2497.Waggott and Davies, 1984Hydrogen; Column length: 50. m; Column diameter: 0.32 mm; Program: not specified
CapillaryOV-1, SE-30, Methyl silicone, SP-2100, OV-101, DB-1, etc.2500.Waggott and Davies, 1984Hydrogen; Column length: 50. m; Column diameter: 0.32 mm; Program: not specified

Lee's RI, non-polar column, temperature ramp

View large format table.

Column type Active phase I Reference Comment
CapillaryDB-1416.5Johnson, Urso, et al., 199730. m/0.2 mm/0.25 μm, 50. C @ 2. min, 5. K/min, 300. C @ 5. min
CapillaryDB-1416.5Johnson, Urso, et al., 199730. m/0.2 mm/0.25 μm, 50. C @ 2. min, 5. K/min, 300. C @ 5. min

References

Johnson, Urso, et al., 1997
Johnson, C.I.; Urso, A.; Geleta, L., Broad spectrum analysis of municipal and industrial effluents discharged into the Peace, Athabasca and Slave river basins: characterization of effluent samples, 1994 - Volume 1 of 2, Northern River Basins Study Project Report No. 121, Norther River Basins Study, Edmonton, Alberta, 1997, 27. [all data]