1,2-Benzenedicarboxylic acid, diundecyl ester
- Formula: C30H50O4
- Molecular weight: 474.7156
- IUPAC Standard InChIKey: QQVHEQUEHCEAKS-UHFFFAOYSA-N
- CAS Registry Number: 3648-20-2
- Chemical structure:

Phase change data

Data compiled by: Robert L. Brown and Stephen E. Stein
Reduced pressure boiling point
Tboil (K) | Pressure (bar) | Reference |
---|---|---|
523. to 525. | 0.0003 | Frinton Laboratories Inc., 1986 |

References

Frinton Laboratories Inc., 1986
Frinton Laboratories Inc.,
Catalog Number 11, Frinton Laboratories Inc., Vineland, NJ, 1986, 99. [all data]