Epoxyaurapten

Van Den Dool and Kratz RI, non-polar column, custom temperature program

View large format table.

Column type Active phase I Reference Comment
CapillaryHP-5MS2776.4Andriamaharavo, 201430. m/0.25 mm/0.25 μm, He; Program: 60C (1 min) => 5 C/min => 210C => 10 C/min => 280C (15 min)

Normal alkane RI, non-polar column, temperature ramp

View large format table.

Column type Active phase I Reference Comment
CapillaryDB-52772.Feger, Brandauer, et al., 200615. m/0.25 mm/0.5 μm, He, 50. C @ 1. min, 10. K/min, 320. C @ 5. min

References

Andriamaharavo, 2014
Andriamaharavo, N.R., Retention Data. NIST Mass Spectrometry Data Center., NIST Mass Spectrometry Data Center, 2014. [all data]

Feger, Brandauer, et al., 2006
Feger, W.; Brandauer, H.; Gabris, P.; Ziegler, H., Nonvolatiles of Commercial Lime and Grapefruit Oils Separated by High-Speed Countercurrent Chromatography, J. Agric. Food Chem., 2006, 54, 6, 2242-2252, https://doi.org/10.1021/jf052267t . [all data]