1,3-Dioxane,2,4,6-trimethyl-,(2α,4α,6β)-

Gas phase thermochemistry data

Data compiled by: Hussein Y. Afeefy, Joel F. Liebman, and Stephen E. Stein

Quantity Value Units Method Reference Comment
Δfgas-447. ± 3.kJ/molCcbPihlaja and Heikkila, 1967

References

Pihlaja and Heikkila, 1967
Pihlaja, K.; Heikkila, J., The configurations of isomeric 2,2,4,6-tetramethyl-1,3-dioxanes, Acta Chem. Scand., 1967, 21, 2430-2434. [all data]