Tricyclo[4.1.1.07,8]octane

Gas phase ion energetics data

Data compiled by: Sharon G. Lias, John E. Bartmess, Joel F. Liebman, John L. Holmes, Rhoda D. Levin, and W. Gary Mallard

Ionization energy determinations

IE (eV) Method Reference Comment
8.2PEGleiter, Bischof, et al., 1986
8.6PEGleiter, Bischof, et al., 1986Vertical value

References

Gleiter, Bischof, et al., 1986
Gleiter, R.; Bischof, P.; Christl, M., Electronic structure of octavalene. Photoelectron spectroscopic investigations, J. Org. Chem., 1986, 51, 2895. [all data]