Acetamide, N-9H-fluoren-2-yl-2,2,2-trifluoro-

Lee's RI, non-polar column, temperature ramp

Data compiled by: NIST Mass Spectrometry Data Center, William E. Wallace, director

Column type CapillaryCapillary
Active phase SE-52SE-52
Column length (m) 12.12.
Carrier gas
Substrate
Column diameter (mm) 0.250.25
Phase thickness (μm)
Tstart (C) 50.50.
Tend (C) 270.270.
Heat rate (K/min) 2.2.
Initial hold (min)
Final hold (min)
I 350.29350.24
ReferenceHasegawa, Usami, et al., 1990Hasegawa, Usami, et al., 1990
Comment MSDC-RI MSDC-RI

References

Hasegawa, Usami, et al., 1990
Hasegawa, K.; Usami, S.; Higashide, A., Analysis of amino polycyclic aromatic hydrocarbons and polycyclic aromatic nitrogen heterocycles, Nippon Kagaku Kaishi, 1990, 7, 777-788, https://doi.org/10.1246/nikkashi.1990.777 . [all data]