2-Amino-4,6-dimethoxypyrimidine

Phase change data

Data compiled by: William E. Acree, Jr., James S. Chickos

Enthalpy of fusion

ΔfusH (kcal/mol) Temperature (K) Reference
7.134371.Sun, Song, et al., 2003

References

Sun, Song, et al., 2003
Sun, X.-H.; Song, J.-R.; Tan, Z.-C.; Di, Y.-Y.; Ma, H.-X.; Wang, M.-H.; Sun, L.-X., Huaxue Xuebao, 2003, 61, 12, 1897. [all data]