Bicyclo[3.1.0]hex-3-en-2-one, 5-(1-methylethyl)-

Normal alkane RI, non-polar column, custom temperature program

Data compiled by: NIST Mass Spectrometry Data Center, William E. Wallace, director

Column type Capillary
Active phase SLB-5 MS
Column length (m) 30.
Carrier gas Helium
Substrate
Column diameter (mm) 0.25
Phase thickness (μm) 0.25
Program 50 0C 3 0C/min -> 250 0C (1 min) 10 0C/min -> 300 0C (5 min)
I 1097.
ReferenceCosta, De Fina, et al., 2008
Comment MSDC-RI

Van Den Dool and Kratz RI, non-polar column, custom temperature program

Data compiled by: NIST Mass Spectrometry Data Center, William E. Wallace, director

Column type Capillary
Active phase HP-5MS
Column length (m) 30.
Carrier gas He
Substrate
Column diameter (mm) 0.25
Phase thickness (μm) 0.25
Program 60C (1 min) => 5 C/min => 210C => 10 C/min => 280C (15 min)
I 1128.6
ReferenceAndriamaharavo, 2014
Comment MSDC-RI

Van Den Dool and Kratz RI, non-polar column, temperature ramp

Data compiled by: NIST Mass Spectrometry Data Center, William E. Wallace, director

Column type CapillaryCapillaryCapillary
Active phase CP Sil 5 CBSPB-5OV-1
Column length (m) 25.30.25.
Carrier gas N2He
Substrate
Column diameter (mm) 0.250.250.25
Phase thickness (μm) 0.250.250.3
Tstart (C) 60.60.50.
Tend (C) 280.250.200.
Heat rate (K/min) 4.4.3.
Initial hold (min) 6.2.1.
Final hold (min)  20.20.
I 1079.1117.1086.
ReferencePino, Marbot, et al., 2002Pino, Marbot, et al., 2002, 2Bicchi, Rubiolo, et al., 1998
Comment MSDC-RI MSDC-RI MSDC-RI

Normal alkane RI, polar column, custom temperature program

Data compiled by: NIST Mass Spectrometry Data Center, William E. Wallace, director

Column type CapillaryCapillaryCapillary
Active phase HP-InnowaxInnowax FSCHP-Innowax
Column length (m) 60.60.60.
Carrier gas N2HeHe
Substrate
Column diameter (mm) 0.250.250.25
Phase thickness (μm) 0.250.250.25
Program 60C(10min) => 4C/min => 220C (10min) => 1C/min => 240C60C(10min) => 4C/min => 220C (10min) => 1C/min => 240C60 0C (10 min) 4 K/min -> 220 0C (10 min) 1 K/min -> 240 0C
I 1643.1643.1643.
ReferenceDemirci, Demirci, et al., 2005Baser, Demirci, et al., 2003Gören, Demirci, et al., 2001
Comment MSDC-RI MSDC-RI MSDC-RI

References

Costa, De Fina, et al., 2008
Costa, R.; De Fina, M.R.; Valentino, M.R.; Rustaiyan, A.; Dugo, P.; Dugo, G.; Mondello, L., An investigation on the volatile composition of some Artemisia species from Iran, Flavour Fragr. J., 2008, 24, 2, 75-82, https://doi.org/10.1002/ffj.1919 . [all data]