Cycloocta[def]biphenylene

Gas phase ion energetics data

Data compiled by: Sharon G. Lias, John E. Bartmess, Joel F. Liebman, John L. Holmes, Rhoda D. Levin, and W. Gary Mallard

Ionization energy determinations

IE (eV) Method Reference Comment
7.24PEWilcox, Blain, et al., 1986Vertical value

References

Wilcox, Blain, et al., 1986
Wilcox, C.F., Jr.; Blain, D.A.; Clardy, J.; Van Duyne, G.; Gleiter, R.; Eckert-Maksic, M., 3H-Cyclonona[def]biphenylene: An example of neutral homoantiaromaticity, J. Am. Chem. Soc., 1986, 108, 7693. [all data]