1,4-Epoxynaphthalene-2,3-dicarbonitrile, 1,2,3,4-tetrahydro-1,4-diphenyl-(1α,2α,3β,4α)-

Reaction thermochemistry data

Data compiled by: Hussein Y. Afeefy, Joel F. Liebman, and Stephen E. Stein

Individual Reactions

1,3 Diphenylisobenzofuran + Fumaronitrile = C24H16N2O

By formula: C20H14O + C4H2N2 = C24H16N2O

Quantity Value Units Method Reference Comment
Δr-82.kJ/molKinSamuilov, Nurullina, et al., 1983liquid phase; solvent: Dichloroethane; Unpublished results

2-Butynedinitrile + 1,3 Diphenylisobenzofuran = C24H16N2O

By formula: C4N2 + C20H14O = C24H16N2O

Quantity Value Units Method Reference Comment
Δr-129.kJ/molKinSamuilov, Nurullina, et al., 1983liquid phase; solvent: Nonaquous

References

Samuilov, Nurullina, et al., 1983
Samuilov, Ya.D.; Nurullina, R.L.; Konovalov, A.I., Thermochemical and kinetic study of the Diels-Alder reaction with ethylene and acetylene dienophiles, Zh. Org. Khim., 1983, 19, 1431-1435. [all data]