1,4-Epoxynaphthalene-2,3-dicarboxylic acid, 1-4-diphenyl-, (1α,2β,3β,4α)-

Reaction thermochemistry data

Data compiled by: Hussein Y. Afeefy, Joel F. Liebman, and Stephen E. Stein

Individual Reactions

1,3 Diphenylisobenzofuran + Dimethyl fumarate = C26H22O5

By formula: C20H14O + C6H8O4 = C26H22O5

Quantity Value Units Method Reference Comment
Δr-15.kcal/molKinSamuilov, Nurullina, et al., 1983liquid phase; solvent: Dichloroethane
Δr-15.kcal/molKinSamuilov, Nurullina, et al., 1983liquid phase; solvent: Nonaquous

References

Samuilov, Nurullina, et al., 1983
Samuilov, Ya.D.; Nurullina, R.L.; Konovalov, A.I., Thermochemical and kinetic study of the Diels-Alder reaction with ethylene and acetylene dienophiles, Zh. Org. Khim., 1983, 19, 1431-1435. [all data]