Dicarbonyl((1,2,3,4,5-η5)-1-methyl-2,4-cyclopentadien-1-yl)(1,1'-thiobis(benzene)-s)manganese

Gas phase ion energetics data

Data compiled by: Sharon G. Lias, Rhoda D. Levin, and Sherif A. Kafafi

Ionization energy determinations

IE (eV) Method Reference
6.27 ± 0.05EIDistefano, Foffani, et al., 1971
6.27EIDistefano, Foffani, et al., 1971, 2

Appearance energy determinations

Ion AE (eV) Other Products MethodReferenceComment
C18H17SMn+8.0 ± 0.12COEIDistefano, Foffani, et al., 1971

References

Distefano, Foffani, et al., 1971
Distefano, G.; Foffani, A.; Innorta, G.; Pignataro, S., Mass spectrometric study of transition metal complexes with ligands having nitrogen or sulphur as donor atom, Adv. Mass Spectrom., 1971, 5, 696. [all data]

Distefano, Foffani, et al., 1971, 2
Distefano, G.; Foffani, A.; Innorta, G.; Pignataro, S., Electron impact ionization potentials of some manganese, chromium and tungsten organometallic derivatives, Int. J. Mass Spectrom. Ion Phys., 1971, 7, 383. [all data]