2-Cyclohexen-1-one, 4-(3-hydroxybutyl)-3,5,5-trimethyl-

Normal alkane RI, non-polar column, temperature ramp

Data compiled by: NIST Mass Spectrometry Data Center, William E. Wallace, director

Column type CapillaryCapillary
Active phase SPB-1SPB-5
Column length (m) 30.30.
Carrier gas HeliumHe
Substrate
Column diameter (mm) 0.250.53
Phase thickness (μm) 0.25
Tstart (C) 50.100.
Tend (C) 250.250.
Heat rate (K/min) 5.5.
Initial hold (min) 3.
Final hold (min) 15.
I 1731.1745.
ReferenceLazarevic, Palic, et al., 2010Kilic, Kollmannsberger, et al., 2005
Comment MSDC-RI MSDC-RI

Normal alkane RI, polar column, temperature ramp

Data compiled by: NIST Mass Spectrometry Data Center, William E. Wallace, director

Column type Capillary
Active phase DB-Wax Etr
Column length (m) 60.
Carrier gas He
Substrate
Column diameter (mm) 0.25
Phase thickness (μm) 0.25
Tstart (C) 40.
Tend (C) 230.
Heat rate (K/min) 2.
Initial hold (min) 5.
Final hold (min) 100.
I 2730.
ReferenceIbarz, Ferreira, et al., 2006
Comment MSDC-RI

Van Den Dool and Kratz RI, polar column, custom temperature program

Data compiled by: NIST Mass Spectrometry Data Center, William E. Wallace, director

Column type Capillary
Active phase Carbowax 20M
Column length (m) 25.
Carrier gas H2
Substrate
Column diameter (mm) 0.32
Phase thickness (μm) 0.25
Program 40C (8min) => 3C/min => 180C => 20C/min => 230C
I 2726.
ReferenceBoido, Lloret, et al., 2003
Comment MSDC-RI

Van Den Dool and Kratz RI, polar column, temperature ramp

Data compiled by: NIST Mass Spectrometry Data Center, William E. Wallace, director

Column type CapillaryCapillaryCapillaryCapillary
Active phase DB-WaxDB-WaxDB-WaxDB-Wax
Column length (m) 30.30.30.30.
Carrier gas  HeHeHe
Substrate
Column diameter (mm) 0.320.320.320.25
Phase thickness (μm) 0.50.50.50.25
Tstart (C) 40.60.60.50.
Tend (C) 245.245.245.220.
Heat rate (K/min) 3.3.3.4.
Initial hold (min) 3.3.3.3.
Final hold (min) 20.20.20.20.
I 2732.2726.2704.2694.
ReferenceAubert, Ambid, et al., 2003Wirth, Guo, et al., 2001Bureau, Baumes, et al., 2000Humpf and Schreier, 1991
Comment MSDC-RI MSDC-RI MSDC-RI MSDC-RI

Van Den Dool and Kratz RI, non-polar column, custom temperature program

Data compiled by: NIST Mass Spectrometry Data Center, William E. Wallace, director

Column type Capillary
Active phase HP-5MS
Column length (m) 30.
Carrier gas He
Substrate
Column diameter (mm) 0.25
Phase thickness (μm) 0.25
Program 60C (1 min) => 5 C/min => 210C => 10 C/min => 280C (15 min)
I 1709.7
ReferenceAndriamaharavo, 2014
Comment MSDC-RI

References

Lazarevic, Palic, et al., 2010
Lazarevic, J.S.; Palic, R.V.M.; Radulovic, N.S.; Ristic, N.R.; Stojanovic, G.S., Chemical composition and screening of the antimicrobial and antioxidative acrivity of extracts of Stachys species, J. Serb. Chem. Soc., 2010, 75, 10, 1347-1359, https://doi.org/10.2298/JSC100601117L . [all data]

Kilic, Kollmannsberger, et al., 2005
Kilic, A.; Kollmannsberger, H.; Nitz, S., Glycosidically bound volatiles and flavor precursors in Laurus nobilis L., J. Agric. Food Chem., 2005, 53, 6, 2231-2235, https://doi.org/10.1021/jf040373+ . [all data]