Chromium, pentacarbonyl[sulfinylbis[methane]-s]-

Gas phase ion energetics data

Data compiled by: Sharon G. Lias, Rhoda D. Levin, and Sherif A. Kafafi

Ionization energy determinations

IE (eV) Method Reference
7.64 ± 0.05EIDistefano, Foffani, et al., 1971
7.64EIDistefano, Foffani, et al., 1971, 2

References

Distefano, Foffani, et al., 1971
Distefano, G.; Foffani, A.; Innorta, G.; Pignataro, S., Mass spectrometric study of transition metal complexes with ligands having nitrogen or sulphur as donor atom, Adv. Mass Spectrom., 1971, 5, 696. [all data]

Distefano, Foffani, et al., 1971, 2
Distefano, G.; Foffani, A.; Innorta, G.; Pignataro, S., Electron impact ionization potentials of some manganese, chromium and tungsten organometallic derivatives, Int. J. Mass Spectrom. Ion Phys., 1971, 7, 383. [all data]