Pentazocine

Van Den Dool and Kratz RI, non-polar column, temperature ramp

Data compiled by: NIST Mass Spectrometry Data Center, William E. Wallace, director

Column type CapillaryCapillaryPacked
Active phase SPB-1SE-30SE-30
Column length (m) 30.15.1.8
Carrier gas HeHeN2
Substrate   Chromosorb W
Column diameter (mm) 0.750.25
Phase thickness (μm) 1.00.25
Tstart (C) 160.100.130.
Tend (C) 280.295.290.
Heat rate (K/min) 10.5.8.
Initial hold (min)   2.
Final hold (min) 12. 8.
I 2280.2246.2285.
ReferenceChrist, Noomano, et al., 1988Anderson and Stafford, 1983Perrigo and Peel, 1981
Comment MSDC-RI MSDC-RI MSDC-RI

Normal alkane RI, non-polar column, custom temperature program

Data compiled by: NIST Mass Spectrometry Data Center, William E. Wallace, director

Column type CapillaryCapillaryOther
Active phase BP-1BP-1Methyl Silicone
Column length (m) 12.12.
Carrier gas HeHe
Substrate
Column diameter (mm) 0.220.22
Phase thickness (μm) 0.250.25
Program 120 0X 8 0C/min -> 270 0C 25 0C/min -> 300 0C (5 min)not specifiednot specified
I 2262.2265.2275.
ReferenceStowell and Wilson, 1985Stowell and Wilson, 1985Ardrey and Moffat, 1981
Comment MSDC-RI MSDC-RI MSDC-RI

Van Den Dool and Kratz RI, non-polar column, custom temperature program

Data compiled by: NIST Mass Spectrometry Data Center, William E. Wallace, director

Column type Capillary
Active phase BP-1
Column length (m) 12.
Carrier gas He
Substrate
Column diameter (mm) 0.22
Phase thickness (μm) 0.25
Program 120C => 8C/min => 270C => 25C/min => 300C
I 2262.
ReferenceStowell and Wilson, 1987
Comment MSDC-RI

References

Christ, Noomano, et al., 1988
Christ, D.W.; Noomano, P.; Rosas, M.; Rhone, D., Retention indices by wide-bore capillary gas chromatography with nitrogen-phosphorus detection, J. Anal. Toxicol., 1988, 12, 2, 84-88, https://doi.org/10.1093/jat/12.2.84 . [all data]

Anderson and Stafford, 1983
Anderson, W.H.; Stafford, D.T., Applications of capillary gas chromatography in routine toxicological analyses, J. Hi. Res. Chromatogr. Chromatogr. Comm., 1983, 6, 5, 247-254, https://doi.org/10.1002/jhrc.1240060506 . [all data]

Perrigo and Peel, 1981
Perrigo, B.J.; Peel, H.W., The use of retention indices and temperature-programmed gas chromatography in analytical toxicology, J. Chromatogr. Sci., 1981, 19, 5, 219-226, https://doi.org/10.1093/chromsci/19.5.219 . [all data]