oxalyl difluoride

Phase change data

Data compiled as indicated in comments:
BS - Robert L. Brown and Stephen E. Stein
TRC - Thermodynamics Research Center, NIST Boulder Laboratories, Chris Muzny director
DH - Eugene S. Domalski and Elizabeth D. Hearing
AC - William E. Acree, Jr., James S. Chickos

Quantity Value Units Method Reference Comment
Tboil299.7KN/APCR Inc., 1990BS
Quantity Value Units Method Reference Comment
Ttriple260.73KN/AHodge, 1971Uncertainty assigned by TRC = 0.05 K; TRC

Enthalpy of vaporization

ΔvapH (kJ/mol) Temperature (K) Reference Comment
28.255270.13Hodge, 1971, 2DH
29.7268.Stephenson and Malanowski, 1987Based on data from 264. - 272. K.; AC

Entropy of vaporization

ΔvapS (J/mol*K) Temperature (K) Reference Comment
104.6270.13Hodge, 1971, 2DH

Enthalpy of sublimation

ΔsubH (kJ/mol) Temperature (K) Reference Comment
16.7247.Stephenson and Malanowski, 1987Based on data from 234. - 260. K.; AC

Enthalpy of fusion

ΔfusH (kJ/mol) Temperature (K) Reference Comment
13.407260.73Hodge, 1971, 2DH

Entropy of fusion

ΔfusS (J/mol*K) Temperature (K) Reference Comment
51.4260.73Hodge, 1971, 2DH

In addition to the Thermodynamics Research Center (TRC) data available from this site, much more physical and chemical property data is available from the following TRC products:

Reaction thermochemistry data

Data compiled as indicated in comments:
B - John E. Bartmess
M - Michael M. Meot-Ner (Mautner) and Sharon G. Lias

Individual Reactions

Fluorine anion + C2F2O2 = (Fluorine anion • C2F2O2)

By formula: F- + C2F2O2 = (F- • C2F2O2)

Quantity Value Units Method Reference Comment
Δr191. ± 8.4kJ/molIMRELarson and McMahon, 1985gas phase; These relative affinities are ca. 10 kcal/mol weaker than threshold values (see Wenthold and Squires, 1995) for donors greater than ca. 27 kcal/mol in free energy. This discrepancy has not yet been resolved, though the stronger value appears preferable.; B,M
Quantity Value Units Method Reference Comment
Δr120.J/mol*KN/ALarson and McMahon, 1985gas phase; switching reaction,Thermochemical ladder(F-)H2O, Entropy change calculated or estimated; Arshadi, Yamdagni, et al., 1970; M
Quantity Value Units Method Reference Comment
Δr155. ± 8.4kJ/molIMRELarson and McMahon, 1985gas phase; These relative affinities are ca. 10 kcal/mol weaker than threshold values (see Wenthold and Squires, 1995) for donors greater than ca. 27 kcal/mol in free energy. This discrepancy has not yet been resolved, though the stronger value appears preferable.; B,M

References

PCR Inc., 1990
PCR Inc., Research Chemicals Catalog 1990-1991, PCR Inc., Gainesville, FL, 1990, 1. [all data]

Hodge, 1971
Hodge, P.E., The thermodynamic properties of trifluoroacetyl fluoride from 14 K to its boiling point and the thermodynamic properties of oxalyl fluoride from 130K to its normal boiling point. molecular data, Ph.D. Dissertation, Case Western Reserve University, Cleve- land, OH, 1971. [all data]

Hodge, 1971, 2
Hodge, P.E., The thermodynamic properties of trifluoroacetyl fluoride from 14 K to its normal boiling point and the thermodynamic properties of oxalyl fluoride from 130K to its normal boiling point. The entropies from spectroscopic and molecular data, Diss. Abstr., 1971, 32, 1482-1483. [all data]

Stephenson and Malanowski, 1987
Stephenson, Richard M.; Malanowski, Stanislaw, Handbook of the Thermodynamics of Organic Compounds, 1987, https://doi.org/10.1007/978-94-009-3173-2 . [all data]

Larson and McMahon, 1985
Larson, J.W.; McMahon, T.B., Fluoride and chloride affinities of the main group oxides, fluorides, oxofluorides, and alkyls. Quantitative scales of lewis acidities from ICR halide exchange equilibria, J. Am. Chem. Soc., 1985, 107, 766. [all data]

Wenthold and Squires, 1995
Wenthold, P.G.; Squires, R.R., Bond dissociation energies of F2(-) and HF2(-). A gas-phase experimental and G2 theoretical study, J. Phys. Chem., 1995, 99, 7, 2002, https://doi.org/10.1021/j100007a034 . [all data]

Arshadi, Yamdagni, et al., 1970
Arshadi, M.; Yamdagni, R.; Kebarle, P., Hydration of Halide Negative Ions in the Gas Phase. II. Comparison of Hydration Energies for the Alkali Positive and Halide Negative Ions, J. Phys. Chem., 1970, 74, 7, 1475, https://doi.org/10.1021/j100702a014 . [all data]