Benzenamine, N-[(4-methoxyphenyl)methylene]-, N-oxide

Gas phase thermochemistry data

Data compiled by: Hussein Y. Afeefy, Joel F. Liebman, and Stephen E. Stein

Quantity Value Units Method Reference Comment
Δfgas109.7 ± 2.5kJ/molCcbKirchner, Acree, et al., 1986

Condensed phase thermochemistry data

Data compiled by: Hussein Y. Afeefy, Joel F. Liebman, and Stephen E. Stein

Quantity Value Units Method Reference Comment
Δfsolid-20.9 ± 2.2kJ/molCcbKirchner, Acree, et al., 1986
Quantity Value Units Method Reference Comment
Δcsolid-7346.1 ± 1.2kJ/molCcbKirchner, Acree, et al., 1986

Phase change data

Data compiled as indicated in comments:
ALS - Hussein Y. Afeefy, Joel F. Liebman, and Stephen E. Stein
AC - William E. Acree, Jr., James S. Chickos

Quantity Value Units Method Reference Comment
Δsub130.6 ± 1.2kJ/molCKirchner, Acree, et al., 1986ALS
Δsub130.6 ± 1.2kJ/molCKirchner, Acree, et al., 1986AC

References

Kirchner, Acree, et al., 1986
Kirchner, J.J.; Acree, W.E., Jr.; Pilcher, G.; Shaofeng, L., Enthalpies of combustion of four N-phenylmethylene benzenamine N-oxide derivatives, of N-phenylmethylene benzenamine, and of trans-diphenyldiazene N-oxide: the dissociation enthalpy of the (N-O)bonds, J. Chem. Thermodyn., 1986, 18, 793-799. [all data]