(6Z)-Nonen-1-ol

Van Den Dool and Kratz RI, polar column, custom temperature program

Data compiled by: NIST Mass Spectrometry Data Center, William E. Wallace, director

Column type Capillary
Active phase DB-Wax
Column length (m) 30.
Carrier gas H2
Substrate
Column diameter (mm) 0.25
Phase thickness (μm) 0.25
Program 60 0C (3 min) 2 K/min -> 220 0C 5 K/min -> 250 0C (15 min)
I 1688.
ReferenceBoulanger and Crouzet, 2000
Comment MSDC-RI

Kovats' RI, polar column, temperature ramp

Data compiled by: NIST Mass Spectrometry Data Center, William E. Wallace, director

Column type Capillary
Active phase Carbowax 20M
Column length (m) 150.
Carrier gas He
Substrate
Column diameter (mm) 0.64
Phase thickness (μm)
Tstart (C) 50.
Tend (C) 170.
Heat rate (K/min) 1.
Initial hold (min)
Final hold (min)
I 1710.
ReferenceButtery, Seifert, et al., 1982
Comment MSDC-RI

References

Boulanger and Crouzet, 2000
Boulanger, R.; Crouzet, J., Free and bound flavour components of Amazonian fruits: 2. cupuacu volatile compounds, Flavour Fragr. J., 2000, 15, 4, 251-257, https://doi.org/10.1002/1099-1026(200007/08)15:4<251::AID-FFJ905>3.0.CO;2-2 . [all data]