Thiazole, 4,5-dimethyl-

Van Den Dool and Kratz RI, non-polar column, custom temperature program

Data compiled by: NIST Mass Spectrometry Data Center, William E. Wallace, director

Column type CapillaryCapillaryCapillaryCapillaryCapillary
Active phase DB-5CP-Sil 8CB-MSDB-5BPX-5DB-5
Column length (m) 30.60.50.50.50.
Carrier gas HeHeHeHeHe
Substrate
Column diameter (mm) 0.320.250.320.320.32
Phase thickness (μm) 0.250.250.50.5
Program 40C(3min) => 3C/min => 180C => 10C/min => 260C(2min)0C(5min) => 40C/min => 40C (2min) => 4C/min => 280CoC(5min) => 60C/min => 60C (5min) => 4C/min => 250C0C(5min) => 40C/min => 40C(2min) => 4C/min => 280C0C => 60C/min => 60C (5min) => 4C/min => 250C
I 910.937.945.945.933.
ReferenceMoon, Cliff, et al., 2006Elmore, Mottram, et al., 2000Parker, Hassell, et al., 2000Elmore, Mottram, et al., 1999Mottram and Whitfield, 1995
Comment MSDC-RI MSDC-RI MSDC-RI MSDC-RI MSDC-RI

Kovats' RI, polar column, isothermal

Data compiled by: NIST Mass Spectrometry Data Center, William E. Wallace, director

Column type CapillaryCapillary
Active phase PEG-40MPEG-40M
Column length (m) 50.50.
Carrier gas HeHe
Substrate
Column diameter (mm) 0.300.30
Phase thickness (μm) 0.40.40
Temperature (C) 110.110.
I 1324.1376.
ReferenceGolovnya, Zhuravleva, et al., 1991Zhuravleva, Shenderyuk, et al., 1990
Comment MSDC-RI MSDC-RI

Phase change data

Data compiled by: Robert L. Brown and Stephen E. Stein

Reduced pressure boiling point

Tboil (K) Pressure (bar) Reference
431.20.989Aldrich Chemical Company Inc., 1990

Normal alkane RI, non-polar column, custom temperature program

Data compiled by: NIST Mass Spectrometry Data Center, William E. Wallace, director

Column type CapillaryCapillaryCapillary
Active phase DB-1DB-1SE-30
Column length (m) 20.20.
Carrier gas
Substrate
Column diameter (mm) 0.180.18
Phase thickness (μm) 0.180.18
Program not specifiednot specifiednot specified
I 907.910.917.
ReferenceChantreau, Rochat, et al., 2006Chantreau, Rochat, et al., 2006Vinogradov, 2004
Comment MSDC-RI MSDC-RI MSDC-RI

References

Moon, Cliff, et al., 2006
Moon, S.-Y.; Cliff, M.A.; Li-Chan, E.C.Y., Odour-active components of simulated beef flavour analysed by solid phase microextraction and gas chromatography-mass spectrometry and -olfactometry, Food Res. Int., 2006, 39, 3, 294-308, https://doi.org/10.1016/j.foodres.2005.08.002 . [all data]

Elmore, Mottram, et al., 2000
Elmore, J.S.; Mottram, D.S.; Enser, M.; Wood, J.D., The effects of diet and breed on the volatile compounds of cooked lamb, Meat Sci., 2000, 55, 2, 149-159, https://doi.org/10.1016/S0309-1740(99)00137-0 . [all data]

Parker, Hassell, et al., 2000
Parker, J.K.; Hassell, G.M.E.; Mottram, D.S.; Guy, R.C.E., Sensory and instrumental analyses of volatiles generated during the extrusion cooking of oat flours, J. Agric. Food Chem., 2000, 48, 8, 3497-3506, https://doi.org/10.1021/jf991302r . [all data]

Elmore, Mottram, et al., 1999
Elmore, J.S.; Mottram, D.S.; Enser, M.; Wood, J.D., Effect of the polyunsaturated fatty acid composition of beef muscle on the profile of aroma volatiles, J. Agric. Food Chem., 1999, 47, 4, 1619-1625, https://doi.org/10.1021/jf980718m . [all data]

Mottram and Whitfield, 1995
Mottram, D.S.; Whitfield, F.B., Volatile compounds from the reaction of cysteine, ribose, and phospholipid in low-moisture systems, J. Agric. Food Chem., 1995, 43, 4, 984-988, https://doi.org/10.1021/jf00052a027 . [all data]