11-Methylhentriacontane

Normal alkane RI, non-polar column, temperature ramp

Data compiled by: NIST Mass Spectrometry Data Center, William E. Wallace, director

Column type CapillaryCapillaryCapillaryCapillaryCapillary
Active phase DB-1Ultra-1DB-5BP-1BP-1
Column length (m) 30.12.530.12.12.
Carrier gas HeliumHeHeHeliumHelium
Substrate
Column diameter (mm) 0.250.20.320.220.22
Phase thickness (μm) 0.25  0.250.25
Tstart (C) 50.150.200.100.100.
Tend (C) 250.320.280.300.300.
Heat rate (K/min) 10.4.3.2.2.
Initial hold (min)
Final hold (min)
I 3134.3130.3130.3126.3131.
ReferenceSteiger, Haberer, et al., 2011Nelson and Charlet, 2003Juárez, Blomquist, et al., 2001Lockey and Oraha, 1990Lockey and Oraha, 1990
Comment MSDC-RI MSDC-RI MSDC-RI MSDC-RI MSDC-RI
Column type CapillaryCapillary
Active phase Dexsil 300Dexsil 300
Column length (m) 15.15.
Carrier gas
Substrate
Column diameter (mm)
Phase thickness (μm)
Tstart (C) 50.50.
Tend (C) 370.370.
Heat rate (K/min) 5.5.
Initial hold (min)
Final hold (min)
I 3130.3130.
ReferenceLockey, 1978Lockey, 1978
Comment MSDC-RI MSDC-RI

Normal alkane RI, non-polar column, custom temperature program

Data compiled by: NIST Mass Spectrometry Data Center, William E. Wallace, director

Column type CapillaryCapillaryCapillaryCapillary
Active phase  DB-1CP Sil 5 CBDexsil 300
Column length (m)  30.25.15.
Carrier gas  HeHe
Substrate
Column diameter (mm)  0.320.32
Phase thickness (μm)  0.250.2
Program not specified60C (2min) => 10C/min => 220C => 3C/min => 310C (12 - 42 min)50C => 20C/min => 130C => 4C/min => 300C (20min)50 0C 5 0C/min -> 200 0C 2 0C/min -> 340 0C
I 3134.3135.3131.3132.
ReferenceSteiger, Peschke, et al., 2007Carlson, Geden, et al., 1999Kenig, Sinninghe Damsté, et al., 1995Lockey, 1981
Comment MSDC-RI MSDC-RI MSDC-RI MSDC-RI

References

Steiger, Haberer, et al., 2011
Steiger, S.; Haberer, W.; Muller, J.K., Social environment determines degree of chemical signalling (Supplemented matherials), Biol. Lett., 2011, 7, 6, 822-824, https://doi.org/10.1098/rsbl.2011.0457 . [all data]

Nelson and Charlet, 2003
Nelson, D.R.; Charlet, L.D., Cuticular hydrocarbons of the sunflower beetle,Zygogramma exclamationis, Comp. Biochem. Physiol. B: Comp. Biochem., 2003, 135, 2, 273-284, https://doi.org/10.1016/S1096-4959(03)00080-0 . [all data]

Juárez, Blomquist, et al., 2001
Juárez, P.; Blomquist, G.J.; Schofield, C.J., Hydrocarbons of Rhodnius prolixus, a Chagas disease vector, Comp. Biochem. Physiol. B: Comp. Biochem., 2001, 129, 4, 733-746, https://doi.org/10.1016/S1096-4959(01)00380-3 . [all data]

Lockey and Oraha, 1990
Lockey, K.H.; Oraha, V.S., Cuticular lipids of adult Locusta Migratoria Migratoriodes (R and F), Schstocerca Gregaria (Forskal) (Acrididae) and other orthopteran species - II. Hydrocarbons, Comp. Biochem. Physiol., 1990, 95B, 4, 721-744. [all data]

Lockey, 1978
Lockey, K.H., The adult cuticular hydrocarbons of Tenebrio Molitor L. and Tenebrio Obscurus F. (Coleoptera: Tenebrionidae), Insect Biochem., 1978, 8, 4, 237-250, https://doi.org/10.1016/0020-1790(78)90032-X . [all data]