Chromium, pentacarbonyl[1-(methylthio)ethylidene]-

Gas phase ion energetics data

Data compiled by: Sharon G. Lias, Rhoda D. Levin, and Sherif A. Kafafi

Ionization energy determinations

IE (eV) Method Reference Comment
7.35PEBlock and Fenske, 1977Vertical value

References

Block and Fenske, 1977
Block, T.F.; Fenske, R.F., A photoelectron spectroscopic study of some pentacarbonylchromium carbene complexes, J. Am. Chem. Soc., 1977, 99, 4321. [all data]