Brucine

Normal alkane RI, non-polar column, temperature ramp

Data compiled by: NIST Mass Spectrometry Data Center, William E. Wallace, director

Column type Packed
Active phase Polydimethyl siloxane
Column length (m) 2.
Carrier gas Nitrogen
Substrate
Column diameter (mm)
Phase thickness (μm)
Tstart (C) 100.
Tend (C) 300.
Heat rate (K/min)
Initial hold (min)
Final hold (min)
I 3310.
ReferenceMHA, 9999
Comment MSDC-RI

References

MHA, 9999
MHA, Directorate of ForensicScience., Forensic Toxicology, 9999. [all data]