Benzenemethanamine, 2-amino-3,5-dibromo-N-cyclohexyl-N-methyl-

Normal alkane RI, non-polar column, temperature ramp

Data compiled by: NIST Mass Spectrometry Data Center, William E. Wallace, director

Column type PackedPacked
Active phase OV-1SE-30
Column length (m) 2.2.
Carrier gas
Substrate Gas Chrom PGas Chrom P
Column diameter (mm)
Phase thickness (μm)
Tstart (C) 150.150.
Tend (C) 300.300.
Heat rate (K/min) 5.5.
Initial hold (min)
Final hold (min)
I 2370.2380.
ReferenceMarozzi, Gambaro, et al., 1982Marozzi, Gambaro, et al., 1982
Comment MSDC-RI MSDC-RI

References

Marozzi, Gambaro, et al., 1982
Marozzi, E.; Gambaro, V.; Saligari, E.; Mariani, R.; Lodi, F., Use of the retention index in gas chromatographic studies of drugs, J. Anal. Toxicol., 1982, 6, 4, 185-192, https://doi.org/10.1093/jat/6.4.185 . [all data]