Camphenol, 6-

Kovats' RI, non-polar column, temperature ramp

View large format table.

Column type Active phase I Reference Comment
CapillaryDB-51110.Viña and Murillo, 200330. m/0.25 mm/0.25 μm, He, 50. C @ 5. min, 0.5 K/min, 250. C @ 10. min
CapillaryMethyl Silicone1080.Palá-Paúl, Pérez-Alonso, et al., 200250. m/0.25 mm/0.25 μm, He, 4. K/min; Tstart: 70. C; Tend: 240. C
CapillaryOV-1011082.Menut, Molangui, et al., 1995N2, 5. K/min; Column length: 25. m; Column diameter: 0.25 mm; Tstart: 50. C; Tend: 200. C

Van Den Dool and Kratz RI, non-polar column, custom temperature program

View large format table.

Column type Active phase I Reference Comment
CapillaryDB-51110.Özel, Gögüs, et al., 2006Program: not specified

Van Den Dool and Kratz RI, polar column, custom temperature program

View large format table.

Column type Active phase I Reference Comment
CapillarySupelcowax-101468.Bianchi, Cantoni, et al., 200730. m/0.25 mm/0.25 μm; Program: 35C(8min) => 4C/min => 60C => 6C/min => 160C => 20C/min => 220C(1min)

Normal alkane RI, non-polar column, temperature ramp

View large format table.

Column type Active phase I Reference Comment
CapillaryDB-11097.Monser-Esfahani, Karamkhani, et al., 200730. m/0.25 mm/0.25 μm, Helium, 50. C @ 1. min, 2.5 K/min, 260. C @ 20. min
CapillaryDB-51116.Morteza-Semnani K., Saeedi M., et al., 200630. m/0.25 mm/0.25 μm, He, 60. C @ 5. min, 4. K/min; Tend: 220. C
CapillaryDB-11106.Pala-Paul, Perez-Alonso, et al., 200550. m/0.25 mm/0.25 μm, N2, 4. K/min; Tstart: 95. C; Tend: 240. C
CapillaryZB-51112.Jürgens and Dötterl, 200460. m/0.25 mm/0.25 μm, He, 40. C @ 4.6 min, 6. K/min, 260. C @ 1. min

Normal alkane RI, non-polar column, custom temperature program

View large format table.

Column type Active phase I Reference Comment
Capillary 1110.Karimi, Farmany, et al., 2011Program: not specified
CapillaryBPX-51109.Judzentiene and Mockute, 200530. m/0.25 mm/0.25 μm; Program: 60C(0.2min) => 3K/min => 186C => 10C/min => 240C (5min)
CapillaryCP Sil 8 CB1109.Mockute and Judzentiene, 200350. m/0.32 mm/0.25 μm, He; Program: 70C(5min) => 3C/min => 100C (1min) => 25C/min => 250C (10min)

References

Viña and Murillo, 2003
Viña, A.; Murillo, E., Essential oil composition from twelve varieties of basil (Ocimum spp) grown in Columbia, J. Braz. Chem. Soc., 2003, 14, 5, 744-749, https://doi.org/10.1590/S0103-50532003000500008 . [all data]

Palá-Paúl, Pérez-Alonso, et al., 2002
Palá-Paúl, J.; Pérez-Alonso, M.J.; Velasco-Negueruela, A.; Sanz, J., Essential oil composition of Schizogyne glaberrima DC, a species endemic to the Canary Islands, Flavour Fragr. J., 2002, 17, 1, 13-14, https://doi.org/10.1002/ffj.1043 . [all data]

Menut, Molangui, et al., 1995
Menut, C.; Molangui, T.; Lamaty, G.E.; Bessière, J.-M.; Habimana, J.-B. Menut.; Molangui, T.; Lamaty, G.E.; Bessière, J.-M.; Habimana, J.-B., Aromatic plants of tropical Central Africa. 23. Chemical composition of leaf essential oils of Eucalyptus goniocalyx F. Muell. and Eucalyptus patens Benth. grown in Rwanda, J. Agric. Food Chem., 1995, 43, 5, 1267-1271, https://doi.org/10.1021/jf00053a026 . [all data]

Özel, Gögüs, et al., 2006
Özel, M.Z.; Gögüs, F.; Lewis, A.C., Determination of Teucrium chamaedrys volatiles by using direct thermal desorption-comprehensive two-dimensional gas chromatography-time-of-flight mass spectrometry, J. Chromatogr. A, 2006, 1114, 1, 164-169, https://doi.org/10.1016/j.chroma.2006.02.036 . [all data]

Bianchi, Cantoni, et al., 2007
Bianchi, F.; Cantoni, C.; Careri, M.; Chiesa, L.; Musci, M.; Pinna, A., Characterization of the aromatic profile for the authentication and differentiation of typical Italian dry-sausages, Talanta, 2007, 72, 4, 1552-1563, https://doi.org/10.1016/j.talanta.2007.02.019 . [all data]

Monser-Esfahani, Karamkhani, et al., 2007
Monser-Esfahani, H.R.; Karamkhani, F.; Nickavar, B.; Abdi, K.; Faramarzi, M.A., The Volatile Constituents of Dracocephalum kotschyi Oils, Chem. Nat. Comp., 2007, 43, 1, 40-43, https://doi.org/10.1007/s10600-007-0027-z . [all data]

Morteza-Semnani K., Saeedi M., et al., 2006
Morteza-Semnani K.; Saeedi M.; Changizi S., The essential oil composition of Hypericum scabrum L. from Iran, Flavour Fragr. J., 2006, 21, 3, 513-515, https://doi.org/10.1002/ffj.1614 . [all data]

Pala-Paul, Perez-Alonso, et al., 2005
Pala-Paul, J.; Perez-Alonso, M.J.; Velasco-Negueruela, A.; Vadare, J.; Villa, A.M.; Sanz, J.; Brophy, J.J., Essential oil composition of the different parts of Eryngium bourgatii Gouan from Spain, J. Chromatogr. A, 2005, 1074, 1-2, 235-239, https://doi.org/10.1016/j.chroma.2005.03.036 . [all data]

Jürgens and Dötterl, 2004
Jürgens, A.; Dötterl, S., Chemical composition of anther volatiles in Ranunculaceae: genera-specific profiles in Aemone, Aquilegia, Caltha, Pulsatilla, Ranunculus, and Trollius species, American Journal of Botany, 2004, 91, 12, 1969-1980, https://doi.org/10.3732/ajb.91.12.1969 . [all data]

Karimi, Farmany, et al., 2011
Karimi, H.; Farmany, A.; Noorizadeh, H., Prediction of linear retention index of Teucrium chamaedrys volatiles in GCxGC-TOF/MS by linear model, World Appl. Sci. J., 2011, 15, 8, 1086-1088. [all data]

Judzentiene and Mockute, 2005
Judzentiene, A.; Mockute, D., The inflorescence and leaf essential oils of Tanacetum vulgare L. var. vulgare growing wild in Lithuania, Biochem. Syst. Ecol., 2005, 33, 5, 487-498, https://doi.org/10.1016/j.bse.2004.11.003 . [all data]

Mockute and Judzentiene, 2003
Mockute, D.; Judzentiene, A., The myrtenol chemotype of essential oil of Tanacetum vulgare L. var. vulgare (tansy) growing wild in the Vilnius region, Chemija, 2003, 14, 2, 103-107. [all data]