1,4-Oxathiino[3,2-b]pyridine,2,3-dihydro-6-methyl-

Gas phase ion energetics data

Data compiled by: Sharon G. Lias, Rhoda D. Levin, and Sherif A. Kafafi

Ionization energy determinations

IE (eV) Method Reference
8.03 ± 0.05EIGronneberg and Undheim, 1972

References

Gronneberg and Undheim, 1972
Gronneberg, T.; Undheim, K., Mass spectrometry of onium compounds. X: on the evaporation of pyridinium-3-oxides-ionization potential measurements, Org. Mass Spectrom., 1972, 6, 225. [all data]