Cholesteryl stearate

Phase change data

Data compiled by: Eugene S. Domalski and Elizabeth D. Hearing

Enthalpy of phase transition

ΔHtrs (kJ/mol) Temperature (K) Initial Phase Final Phase Reference Comment
67.500355.4crystaline, IliquidKishimoto, Iwasaki, et al., 1986
1.800349.0liquidliquidKishimoto, Iwasaki, et al., 1986
1.700353.0liquidliquidKishimoto, Iwasaki, et al., 1986

Entropy of phase transition

ΔStrs (J/mol*K) Temperature (K) Initial Phase Final Phase Reference Comment
189.9355.4crystaline, I, Solidliquid, isotropicKishimoto, Iwasaki, et al., 1986
5.16349.0liquid, Smecticliquid, cholestericKishimoto, Iwasaki, et al., 1986
4.82353.0liquid, Cholestericliquid, isotropicKishimoto, Iwasaki, et al., 1986

References

Kishimoto, Iwasaki, et al., 1986
Kishimoto, H.; Iwasaki, T.; Yonese, M., Thermodynamic and viscometric studies on the thermotropic phase-stability of cholesteryl myristate, palmitate, stearate, and oleate, Chem. Pharm. Bull., 1986, 34, 2698-2709. [all data]