CHFO2

Reaction thermochemistry data

Data compiled by: John E. Bartmess

Individual Reactions

CFO2- + Hydrogen cation = CHFO2

By formula: CFO2- + H+ = CHFO2

Quantity Value Units Method Reference Comment
Δr329.9 ± 7.8kcal/molD-EAArnold, Bradforth, et al., 1995gas phase
Δr328.49kcal/molAcidLarson and McMahon, 1985gas phase
Quantity Value Units Method Reference Comment
Δr322.6 ± 7.9kcal/molH-TSArnold, Bradforth, et al., 1995gas phase

Gas phase ion energetics data

Data compiled by: John E. Bartmess

De-protonation reactions

CFO2- + Hydrogen cation = CHFO2

By formula: CFO2- + H+ = CHFO2

Quantity Value Units Method Reference Comment
Δr329.9 ± 7.8kcal/molD-EAArnold, Bradforth, et al., 1995gas phase
Δr328.49kcal/molAcidLarson and McMahon, 1985gas phase
Quantity Value Units Method Reference Comment
Δr322.6 ± 7.9kcal/molH-TSArnold, Bradforth, et al., 1995gas phase

References

Arnold, Bradforth, et al., 1995
Arnold, D.W.; Bradforth, S.E.; Kim, E.H.; Neumark, D.M., Study of halogen carbon dioxide clusters and the fluoroformyloxyl radical by photodetachment of X(-)(CO2) (X=I,Cl,Br) and FCO2-, J. Chem. Phys., 1995, 102, 9, 3493, https://doi.org/10.1063/1.468575 . [all data]

Larson and McMahon, 1985
Larson, J.W.; McMahon, T.B., Fluoride and chloride affinities of the main group oxides, fluorides, oxofluorides, and alkyls. Quantitative scales of lewis acidities from ICR halide exchange equilibria, J. Am. Chem. Soc., 1985, 107, 766. [all data]