Hexane, 1,1,1,2,2,3,3,4,4,5,5,6,6-tridecafluoro-

Kovats' RI, non-polar column, isothermal

View large format table.

Column type Active phase Temperature (C) I Reference Comment
PackedSqualane50.300.Müller, Dietrich, et al., 1983

References

Müller, Dietrich, et al., 1983
Müller, U.; Dietrich, P.; Prescher, D., Gaschromatographische Untersuchungen an Perfluor-Carbonverbindungen. II. Zur Gaschromatographischen Trennung von Gemischen Längerkettiger Perfluoralkane und Perfluoralkene, J. Chromatogr., 1983, 259, 243-254, https://doi.org/10.1016/S0021-9673(01)88005-5 . [all data]