Hexyltrichlorogermanium

Phase change data

Data compiled by: William E. Acree, Jr., James S. Chickos

Enthalpy of vaporization

ΔvapH (kJ/mol) Temperature (K) Reference Comment
51.1329.Goncharov and Karapet'yants, 1972Based on data from 315. - 491. K.

References

Goncharov and Karapet'yants, 1972
Goncharov, A.K.; Karapet'yants, M.Kh., Zh. Fiz. Khim., 1972, 46, 1, 228. [all data]