Ethane, 1-chloro-1,1,2,2-tetrafluoro-

Phase change data

Data compiled as indicated in comments:
BS - Robert L. Brown and Stephen E. Stein
TRC - Thermodynamics Research Center, NIST Boulder Laboratories, Chris Muzny director

Quantity Value Units Method Reference Comment
Tboil283.3KN/APCR Inc., 1990BS
Tboil260.KN/ACuculo and Bigelow, 1952Uncertainty assigned by TRC = 3. K; TRC

In addition to the Thermodynamics Research Center (TRC) data available from this site, much more physical and chemical property data is available from the following TRC products:

References

PCR Inc., 1990
PCR Inc., Research Chemicals Catalog 1990-1991, PCR Inc., Gainesville, FL, 1990, 1. [all data]

Cuculo and Bigelow, 1952
Cuculo, J.A.; Bigelow, L.A., The Action of elementary Fluorine upon Organic Compounds. XVII. The Direct Fluorination of Acetonitrile, J. Am. Chem. Soc., 1952, 74, 710. [all data]