Cyclohexene, 4-bromo-

Normal alkane RI, non-polar column, temperature ramp

View large format table.

Column type Active phase I Reference Comment
PackedSE-30969.Peng, Ding, et al., 1988Helium, Supelcoport, 40. C @ 4. min, 10. K/min, 200. C @ 60. min; Column length: 3.05 m
PackedSE-30974.Peng, Ding, et al., 1988Helium, Supelcoport, 40. C @ 4. min, 10. K/min, 200. C @ 60. min; Column length: 3.05 m

Normal alkane RI, non-polar column, custom temperature program

View large format table.

Column type Active phase I Reference Comment
PackedSE-30974.Buchman, Cao, et al., 1984He, Chromosorb AW; Column length: 3.05 m; Program: not specified

References

Peng, Ding, et al., 1988
Peng, C.T.; Ding, S.F.; Hua, R.L., Radioimpurity identification by retention index in tritium labeling, J. Radioanal. Nucl. Chem., 1988, 123, 2, 411-420, https://doi.org/10.1007/BF02034907 . [all data]

Buchman, Cao, et al., 1984
Buchman, O.; Cao, G.-Y.; Peng, C.T., Structure assignment by retention index in gas-liquid radiochromatography of substituted cyclohexenes, J. Chromatogr., 1984, 312, 75-90, https://doi.org/10.1016/S0021-9673(01)92765-7 . [all data]