Tetrakis(trimethylsilylmethyl)chromium

Gas phase ion energetics data

Data compiled by: Sharon G. Lias, Rhoda D. Levin, and Sherif A. Kafafi

Ionization energy determinations

IE (eV) Method Reference Comment
7.3 ± 0.1PEEvans, Green, et al., 1973Vertical value

References

Evans, Green, et al., 1973
Evans, S.; Green, J.C.; Jackson, S.E., He-(I) photoelectron spectra of some metal complexes containing the ligands trimethylsilylmethyl and neopentyl, J. Chem. Soc. Faraday Trans. 2, 1973, 69, 191. [all data]