cis-p-2-Menthen-1-ol

Van Den Dool and Kratz RI, non-polar column, temperature ramp

View large format table.

Column type Active phase I Reference Comment
CapillaryHP-51122.Quijano, Salamanca, et al., 200730. m/0.25 mm/0.25 μm, He, 50. C @ 4. min, 4. K/min, 250. C @ 10. min
CapillaryHP-5MS1121.Pino, Mesa, et al., 200530. m/0.25 mm/0.25 μm, He, 60. C @ 2. min, 4. K/min, 250. C @ 20. min
CapillarySPB-11106.Cavaleiro, Salgueiro, et al., 200330. m/0.2 mm/0.2 μm, He, 3. K/min, 220. C @ 15. min; Tstart: 70. C
CapillaryHP-51117.Skaltsa, Demetzos, et al., 200330. m/0.25 mm/0.25 μm, He, 60. C @ 5. min, 4. K/min; Tend: 280. C
CapillaryHP-5MS1117.Skaltsa, Mavrommati, et al., 200130. m/0.25 mm/0.25 μm, He, 60. C @ 5. min, 4. K/min; Tend: 280. C

Normal alkane RI, non-polar column, temperature ramp

View large format table.

Column type Active phase I Reference Comment
CapillaryDB-51101.Tzakou and Constantinidis, 200530. m/0.32 mm/0.25 μm, He, 3. K/min; Tstart: 60. C; Tend: 280. C
CapillaryDB-51120.Pino, Marbot, et al., 200330. m/0.25 mm/0.25 μm, H2, 60. C @ 10. min, 4. K/min, 280. C @ 40. min
CapillaryHP-51110.Pitarokili, Tzakou, et al., 200330. m/0.25 mm/0.25 μm, He, 3. K/min; Tstart: 60. C; Tend: 280. C

Normal alkane RI, non-polar column, custom temperature program

View large format table.

Column type Active phase I Reference Comment
CapillaryDB-11110.Albano, Lima, et al., 201230. m/0.25 mm/0.25 μm, Hydrogen; Program: 45 0C 3 0C/min -> 175 0C 15 0C/min -> 300 0C (10 min)
CapillaryDB-11110.Mendes, Trindade, et al., 200930. m/0.25 mm/0.25 μm, Hydrogen; Program: 45 0C 3 0C/min -> 175 0C 15 0C/min -> 300 0C (10 min)

Normal alkane RI, polar column, custom temperature program

View large format table.

Column type Active phase I Reference Comment
CapillaryFFAP1541.Reddy, Angers, et al., 199825. m/0.2 mm/0.33 μm, H2; Program: 40C(5min) => 4C/min => 170C => 8C/min => 240C (12min)

References

Quijano, Salamanca, et al., 2007
Quijano, C.E.; Salamanca, G.; Pino, J.A., Aroma volatile constituents of Colombian varieties of mango (Mangifera indica L.), Flavour Fragr. J., 2007, 22, 5, 401-406, https://doi.org/10.1002/ffj.1812 . [all data]

Pino, Mesa, et al., 2005
Pino, J.A.; Mesa, J.; Muñoz, Y.; Martí, M.P.; Marbot, R., Volatile components from mango (Mangifera indica L.) cultivars, J. Agric. Food Chem., 2005, 53, 6, 2213-2223, https://doi.org/10.1021/jf0402633 . [all data]

Cavaleiro, Salgueiro, et al., 2003
Cavaleiro, C.; Salgueiro, L.R.; da Cunha, A.P.; Figueiredo, A.C.; Barroso, J.G.; Bighelli, A.; Casanova, J., Composition and variability of the essential oils of the leaves and berries from Juniperus navicularis, Biochem. Syst. Ecol., 2003, 31, 2, 193-201, https://doi.org/10.1016/S0305-1978(02)00080-7 . [all data]

Skaltsa, Demetzos, et al., 2003
Skaltsa, H.D.; Demetzos, C.; Lazari, D.; Sokovic, M., Essential oil analysis and antimicrobial activity of eight Stachys species from Greece, Phytochemistry, 2003, 64, 3, 743-752, https://doi.org/10.1016/S0031-9422(03)00386-8 . [all data]

Skaltsa, Mavrommati, et al., 2001
Skaltsa, H.D.; Mavrommati, A.; Constantinidis, T., A chemotaxonomic investigation of volatile constituents in Stachys subsect. Swainsonianeae (Labiatae), Phytochemistry, 2001, 57, 2, 235-244, https://doi.org/10.1016/S0031-9422(01)00003-6 . [all data]

Tzakou and Constantinidis, 2005
Tzakou, O.; Constantinidis, T., Chemotaxonomic significance of volatile compounds in Thymus samius and its related species Thymus atticus and Thymus parnassicus, Biochem. Syst. Ecol., 2005, 33, 11, 1131-1140, https://doi.org/10.1016/j.bse.2005.03.008 . [all data]

Pino, Marbot, et al., 2003
Pino, J.A.; Marbot, R.; Fuentes, V., Characterization of volatiles in Bullock's heart (Annona reticulata L.) fruit cultivars from Cuba, J. Agric. Food Chem., 2003, 51, 13, 3836-3839, https://doi.org/10.1021/jf020733y . [all data]

Pitarokili, Tzakou, et al., 2003
Pitarokili, D.; Tzakou, O.; Loukis, A.; Harvala, C., Volatile metabolites from Salvia fruticosa as antifungal agents in soilborne pathogens, J. Agric. Food Chem., 2003, 51, 11, 3294-3301, https://doi.org/10.1021/jf0211534 . [all data]

Albano, Lima, et al., 2012
Albano, S.M.; Lima, A.S.; Miguel, M.G.; Pedro, L.G.; Barroso, J.G.; Figueiredo, A.C., Antioxidant, anti-5-lipoxygenase and antiacetylcholinesterase activities of essential oils and decoction water of some aromatic plants, Rec. Nat. Prod., 2012, 6, 1, 35-48. [all data]

Mendes, Trindade, et al., 2009
Mendes, M.D.; Trindade, H.; Figueiredo, A.C.; Barroso, J.G.; Fontinha, S.S.; Pedro, L.G., Volatile and molecular characterization of two Portuguese endemic species: Angelica lignescens and Melanoselinium decipiens, Biochen. Systematics Ecol., 2009, 37, 2, 98-105, https://doi.org/10.1016/j.bse.2008.12.006 . [all data]

Reddy, Angers, et al., 1998
Reddy, M.V.B.; Angers, P.; Gosselin, A.; Arul, J., Characterization and use of essential oil from Thymus vulgaris against Botrytis cinerea and Rhizopus stolonifer in strawberry fruits, Phytochemistry, 1998, 47, 8, 1515-1520, https://doi.org/10.1016/S0031-9422(97)00795-4 . [all data]