9-Octadecyne

Phase change data

Data compiled by: Thermodynamics Research Center, NIST Boulder Laboratories, Chris Muzny director

Quantity Value Units Method Reference Comment
Tboil415.KN/ADeatherage and Olcott, 1939Uncertainty assigned by TRC = 4. K
Quantity Value Units Method Reference Comment
Tfus272.8KN/AElsner and Paul, 1951Uncertainty assigned by TRC = 2. K
Tfus276.KN/ADeatherage and Olcott, 1939Uncertainty assigned by TRC = 4. K

In addition to the Thermodynamics Research Center (TRC) data available from this site, much more physical and chemical property data is available from the following TRC products:

References

Deatherage and Olcott, 1939
Deatherage, F.E.; Olcott, H.S., Synthesis of cic-9-Octadecene, 9-Octadecyne, and 9,10-Octadecane-diol, J. Am. Chem. Soc., 1939, 61, 630. [all data]

Elsner and Paul, 1951
Elsner, B.B.; Paul, P.F.M., The application of lithium alkynyls in the synthesis of long-chain dialkylacetylenes, J. Chem. Soc., 1951, 1951, 893. [all data]